{"text_format":"1","workbook":"xlsx","n_sheets":11,"sheets":["SMSF","User Guide - SMSF","HEM Table","Validation","Tax Table","Inputs","Version Control","Superannuation Assessment notes","Loan Summary","Conditions","Workings"],"not_rendered":{"charts":0,"images":4,"macros":1,"external_links":0,"defined_names":168,"comments":1,"pivot_tables":0},"unopened":[],"bounds":{"document_bytes":16777216,"sheet_cells":100000,"rows_first":2000,"rows_last":500,"rows_between":2000,"halvings":0,"cell_chars":16384,"cell_head_chars":4096},"cells_cut":0,"cells_raw":0,"read":"whole","date_system":"1900"}

{"sheet":"SMSF","index":0,"n_rows":95,"n_cols":20,"rows_kept":95,"cut":false,"hidden":false,"merged":[[3,4,3,12],[71,6,71,12],[24,4,24,14],[43,2,49,4],[22,4,22,14],[19,4,19,14],[94,0,94,16],[7,18,9,18],[26,18,29,18],[48,12,48,14],[49,12,49,14]]}
[null,"SMSF Servicability Calculator"]
[null,null,"Version v2 - Effective 16th October 2023"]
[]
[null,null,"SMSF Name"]
[]
[null,null,"Proposed Loan Details"]
[]
[null,null,"New Loan Amount",null,null,null,null,null,null,null,"Interest Rate",null,null,null,null,null,null,null,"Interest expense annually"]
[null,null,null,null,null,null,null,null,null,null,"Loan Term (Years)"]
[null,null,null,null,null,null,null,null,null,null,"I/O Term (Years)"]
[null,null,null,null,null,null,null,null,null,null,"P&I Repayment",null,{"$f":"IF(LoanTermInYears>IOTermInYears,-PMT((MAX(BaselineAssessmentRate,InterestRate+AssessmentLoading))/NumberOfMonthsInAYear,NumberOfMonthsInAYear*(LoanTermInYears-IOTermInYears),NewLoanAmount),0)","v":0},null,null,null,null,null,{"$f":"E8*((MAX(BaselineAssessmentRate,InterestRate+AssessmentLoading)))","v":0}]
[null,null,null,null,null,null,null,null,null,null,"IO Repayment",null,{"$f":"IF(IOTermInYears>0,NewLoanAmount*(((MAX(BaselineAssessmentRate,InterestRate+AssessmentLoading)))/NumberOfMonthsInAYear),0)","v":0}]
[]
[]
[null,null,"Members Contributions"]
{"$rows_left_out":81}
{"sheet":"User Guide - SMSF","index":1,"n_rows":51,"n_cols":3,"rows_kept":51,"cut":false,"hidden":false,"merged":[]}
["SMSF Serviceability Calculator"]
[]
["Field Name","Instruction","Field type"]
["Clear Form (BUTTON)","Allows the user to clear all fields in the calculator","User entry"]
["SMSF Name","Name of the SMSF the application relates","User entry"]
["New Loan Amount","Mandatory field - total loan amount including any capitalised fees","User entry"]
["Interest Rate","Mandatory field - actual interest rate of the proposed loan","User entry"]
["Loan Term (Years)","Mandatory field -  the total loan term of the proposed loan (maximum term 30 years)","User entry"]
["I/O Term (Years)","The interest only term of the proposed loan. Left blank if not applicable (maximum term 5 years allowed)","User entry"]
["P&I Repayment ","Principal and interest repayment of the proposed loans ammortisation period","Calculated"]
["IO Repayment","Interest Only repayment of the proposed loan, if applicable","Calculated"]
["Superannuation guarantee","Amount Member receives from PAYG employment under the employer superannuation guarantee scheme. Verified through SMSF financials or PAYG income verification.","User entry"]
["PROPOSED CONCESSIONAL contributions","Amount Member intends to pay in addition to the Superannuation guarantee. This amount added with the Superannuation guarantee and PROPOSED CONCESSIONAL contributions values cannot exceed $27,500 for each member. For this amount to be considered, the Members personal financial information needs to be collected and verified and the Members Income & Expense section of the calculator completed. ","User entry"]
["EXISTING CONCESSIONAL contributions","Amount Member currently pays in addition to the Superannuation guarantee. This amount added with the Superannuation guarantee and PROPOSED CONCESSIONAL contributions values cannot exceed $27,500 for each member. For this amount to be considered, the Members personal financial information needs to be collected and verified and the Members Income & Expense section of the calculator completed. ","User entry"]
["Additional NON-CONCESSIONAL contributions","Amount Member does or intends to pay in addition to the Superannuation guarantee and any other conncessional contributions, where that total concessional amount will exceed $27,500. This amount cannot exceed $110,000. This amount added with the Superannuation guarantee value cannot exceed $27,500. For this amount to be considered, the Members personal financial information needs to be collected and verified and the Members Income & Expense section of the calculator completed. \nThe amount to be entered is post-tax which is calculated in the Members Income & Expense section. ","User entry"]
{"$rows_left_out":37}
{"sheet":"HEM Table","index":2,"n_rows":62,"n_cols":19,"rows_kept":62,"cut":false,"hidden":true,"merged":[]}
["Combined Couple Gross Income",null,{"$f":"B2","v":0},{"$f":"C2","v":25000},{"$f":"D2","v":37000},49000,61000,74000,98000,123000,147000,172000,196000,246000,307000,368000,null,null,"Higher income band used as data not available for income band"]
["HEM 2023Q1",null,25000,37000,49000,61000,74000,98000,123000,147000,172000,196000,246000,307000,368000,999999999]
[null,null,1,2,3,4,5,6,7,8,9,10,11,12,13,14]
["Pepper - Proposed"]
["Single","P-S",{"$f":"C25","v":281.88967375827372},{"$f":"D25","v":297.87697304376547},312.2425383027354,332.8163882392883,370.77660279558972,425.65150192223405,501.42968979126897,573.13723163665941,659.52284232324064,704.74917334028123,748.26136520166733,870.33832324444279,987.5418334047414,1031.7519595371839]
["Couple","P-C",{"$f":"D6","v":553.28368370810654},{"$f":"D20","v":553.28368370810654},567.65944127870807,588.24790794372473,626.23508682568411,681.14900853553115,756.98103315359322,828.73947398398207,915.1865124016341,960.44495623987518,1003.9880431092344,1126.1517492515811,1243.4384719356358,1287.6800804572717]
["Single parent with 1 child  (per child)","P-SD1",{"$f":"D7","v":100.31457638341635},{"$f":"IF(D26-D25<0,0,D26-D25)","v":100.31457638341635},100.31332237072917,100.31159574875301,100.30831049775577,100.30364423095659,100.29714079507164,100.29094963498119,100.28356456699748,100.27972519511741,100.27595955940899,100.26551569622939,100.25541632611555,100.25170062822349]
["Single parent with 2 children  (per child)","P-SD2",106.32726364982284,{"$f":"IF(D27-D25<0,0,D27-D25)/2","v":106.32726364982284},106.34412463283815,106.3682559180493,106.41277756132882,106.47714090828828,106.56602194270278,106.65010555299841,106.75145564996626,106.80451125801613,106.85553799777171,106.99869584255339,107.13617424186276,107.18802876428867]
["Single parent with 3 children  (per child)","P-SD3",108.35439205354112,{"$f":"E9","v":108.35439205354112},{"$f":"IF(E28-E25<0,0,E28-E25)/3","v":108.35439205354112},108.38714264114809,108.44759991585317,108.53497313406551,108.65564899191315,108.76982419233748,108.90741934428918,108.97943994564905,109.04873081055932,109.24308922466139,109.42976021377849,109.50013814297706]
["Single parent with 4 or more children  (per child)","P-SD4+",108.35439205354112,108.35439205354112,{"$f":"IF(E28-E25<0,0,E28-E25)/3","v":108.35439205354112},108.38714264114809,108.44759991585317,108.53497313406551,108.65564899191315,108.76982419233748,108.90741934428918,108.97943994564905,109.04873081055932,109.24308922466139,109.42976021377849,109.50013814297706]
["Couple with 1 child (per child)","P-CD1",86.74810811202417,86.74810811202417,{"$f":"IF(E21-E20<0,0,E21-E20)","v":86.74810811202417},86.820403244624231,86.953802068942764,87.146582995753533,87.412899221111729,87.664837824716983,87.968391275635327,88.1273135135948,88.280230752007242,88.709182710967525,89.121027813695719,89.276379497070138]
["Couple with 2 children  (per child)","P-CD2",79.451726823244996,79.451726823244996,{"$f":"IF(E22-E20<0,0,E22-E20)/2","v":79.451726823244996},79.442792174641397,79.426307115298414,79.402458172206138,79.369549820948748,79.338427548092682,79.300876084182335,79.281272140539841,79.262366873110693,79.209324814750744,79.158463207704585,79.139227371248126]
["Couple with 3 children  (per child)","P-CD3",72.497239478274494,72.497239478274494,{"$f":"F13","v":72.497239478274494},{"$f":"IF(F23-F20<0,0,F23-F20)/3","v":72.497239478274494},72.590693219949046,72.72577236483869,72.912323553169429,73.088865783016402,73.301505933470978,73.412875072012255,73.51998744946593,73.820498825776895,74.109043275335651,74.217880203862094]
["Couple with 4 or more children  (per child)","P-CD4+",{"$f":"D14","v":72.497239478274494},{"$f":"E14","v":72.497239478274494},{"$f":"F14","v":72.497239478274494},{"$f":"IF(F23-F20<0,0,F23-F20)/3","v":72.497239478274494},72.590693219949046,72.72577236483869,72.912323553169429,73.088865783016402,73.301505933470978,73.412875072012255,73.51998744946593,73.820498825776895,74.109043275335651,74.217880203862094]
[]
{"$rows_left_out":48}
{"sheet":"Validation","index":3,"n_rows":42,"n_cols":14,"rows_kept":42,"cut":false,"hidden":true,"merged":[]}
["Residential","Member 1","Member 2","Member 3","Member 4","Member 5","Member 6",null,null,"Valid Status",null,null,"Validation Rules","Remarks"]
["Member 1",{"$f":"IF(AND(B$1<>$A2,HLOOKUP($A2,SMSF!$E$55:$O$56,2,FALSE)=\"Individual (Couple)\",SMSF!E$56=\"Individual (Couple)\"),$A2)","v":false},{"$f":"IF(AND(C$1<>$A2,HLOOKUP($A2,SMSF!$E$55:$O$56,2,FALSE)=\"Individual (Couple)\",SMSF!G$56=\"Individual (Couple)\"),$A2)","v":false},{"$f":"IF(AND(D$1<>$A2,HLOOKUP($A2,SMSF!$E$55:$O$56,2,FALSE)=\"Individual (Couple)\",SMSF!I$56=\"Individual (Couple)\"),$A2)","v":false},{"$f":"IF(AND(E$1<>$A2,HLOOKUP($A2,SMSF!$E$55:$O$56,2,FALSE)=\"Individual (Couple)\",SMSF!K$56=\"Individual (Couple)\"),$A2)","v":false},{"$f":"IF(AND(F$1<>$A2,HLOOKUP($A2,SMSF!$E$55:$O$56,2,FALSE)=\"Individual (Couple)\",SMSF!M$56=\"Individual (Couple)\"),$A2)","v":false},{"$f":"IF(AND(G$1<>$A2,HLOOKUP($A2,SMSF!$E$55:$O$56,2,FALSE)=\"Individual (Couple)\",SMSF!O$56=\"Individual (Couple)\"),$A2)","v":false},null,null,"Individual (Single)",null,null,{"$f":"SMSF!E20","v":""},{"$f":"IF(M2=\"\",\"Valid\",\"Invalid\")","v":"Valid"}]
["Member 2",{"$f":"IF(AND(B$1<>$A3,HLOOKUP($A3,SMSF!$E$55:$O$56,2,FALSE)=\"Individual (Couple)\",SMSF!E$56=\"Individual (Couple)\"),$A3)","v":false},{"$f":"IF(AND(C$1<>$A3,HLOOKUP($A3,SMSF!$E$55:$O$56,2,FALSE)=\"Individual (Couple)\",SMSF!G$56=\"Individual (Couple)\"),$A3)","v":false},{"$f":"IF(AND(D$1<>$A3,HLOOKUP($A3,SMSF!$E$55:$O$56,2,FALSE)=\"Individual (Couple)\",SMSF!I$56=\"Individual (Couple)\"),$A3)","v":false},{"$f":"IF(AND(E$1<>$A3,HLOOKUP($A3,SMSF!$E$55:$O$56,2,FALSE)=\"Individual (Couple)\",SMSF!K$56=\"Individual (Couple)\"),$A3)","v":false},{"$f":"IF(AND(F$1<>$A3,HLOOKUP($A3,SMSF!$E$55:$O$56,2,FALSE)=\"Individual (Couple)\",SMSF!M$56=\"Individual (Couple)\"),$A3)","v":false},{"$f":"IF(AND(G$1<>$A3,HLOOKUP($A3,SMSF!$E$55:$O$56,2,FALSE)=\"Individual (Couple)\",SMSF!O$56=\"Individual (Couple)\"),$A3)","v":false},null,null,"Individual (Couple)",null,null,{"$f":"SMSF!C23","v":""},{"$f":"IF(M3=\"\",\"Valid\",\"Invalid\")","v":"Valid"}]
["Member 3",{"$f":"IF(AND(B$1<>$A4,HLOOKUP($A4,SMSF!$E$55:$O$56,2,FALSE)=\"Individual (Couple)\",SMSF!E$56=\"Individual (Couple)\"),$A4)","v":false},{"$f":"IF(AND(C$1<>$A4,HLOOKUP($A4,SMSF!$E$55:$O$56,2,FALSE)=\"Individual (Couple)\",SMSF!G$56=\"Individual (Couple)\"),$A4)","v":false},{"$f":"IF(AND(D$1<>$A4,HLOOKUP($A4,SMSF!$E$55:$O$56,2,FALSE)=\"Individual (Couple)\",SMSF!I$56=\"Individual (Couple)\"),$A4)","v":false},{"$f":"IF(AND(E$1<>$A4,HLOOKUP($A4,SMSF!$E$55:$O$56,2,FALSE)=\"Individual (Couple)\",SMSF!K$56=\"Individual (Couple)\"),$A4)","v":false},{"$f":"IF(AND(F$1<>$A4,HLOOKUP($A4,SMSF!$E$55:$O$56,2,FALSE)=\"Individual (Couple)\",SMSF!M$56=\"Individual (Couple)\"),$A4)","v":false},{"$f":"IF(AND(G$1<>$A4,HLOOKUP($A4,SMSF!$E$55:$O$56,2,FALSE)=\"Individual (Couple)\",SMSF!O$56=\"Individual (Couple)\"),$A4)","v":false},null,null,null,null,null,{"$f":"SMSF!E23","v":0},{"$f":"IF(M4=\"\",\"Valid\",\"Invalid\")","v":"Invalid"}]
["Member 4",{"$f":"IF(AND(B$1<>$A5,HLOOKUP($A5,SMSF!$E$55:$O$56,2,FALSE)=\"Individual (Couple)\",SMSF!E$56=\"Individual (Couple)\"),$A5)","v":false},{"$f":"IF(AND(C$1<>$A5,HLOOKUP($A5,SMSF!$E$55:$O$56,2,FALSE)=\"Individual (Couple)\",SMSF!G$56=\"Individual (Couple)\"),$A5)","v":false},{"$f":"IF(AND(D$1<>$A5,HLOOKUP($A5,SMSF!$E$55:$O$56,2,FALSE)=\"Individual (Couple)\",SMSF!I$56=\"Individual (Couple)\"),$A5)","v":false},{"$f":"IF(AND(E$1<>$A5,HLOOKUP($A5,SMSF!$E$55:$O$56,2,FALSE)=\"Individual (Couple)\",SMSF!K$56=\"Individual (Couple)\"),$A5)","v":false},{"$f":"IF(AND(F$1<>$A5,HLOOKUP($A5,SMSF!$E$55:$O$56,2,FALSE)=\"Individual (Couple)\",SMSF!M$56=\"Individual (Couple)\"),$A5)","v":false},{"$f":"IF(AND(G$1<>$A5,HLOOKUP($A5,SMSF!$E$55:$O$56,2,FALSE)=\"Individual (Couple)\",SMSF!O$56=\"Individual (Couple)\"),$A5)","v":false},null,null,null,null,null,{"$f":"SMSF!C25","v":""},{"$f":"IF(M5=\"\",\"Valid\",\"Invalid\")","v":"Valid"}]
["Member 5",{"$f":"IF(AND(B$1<>$A6,HLOOKUP($A6,SMSF!$E$55:$O$56,2,FALSE)=\"Individual (Couple)\",SMSF!E$56=\"Individual (Couple)\"),$A6)","v":false},{"$f":"IF(AND(C$1<>$A6,HLOOKUP($A6,SMSF!$E$55:$O$56,2,FALSE)=\"Individual (Couple)\",SMSF!G$56=\"Individual (Couple)\"),$A6)","v":false},{"$f":"IF(AND(D$1<>$A6,HLOOKUP($A6,SMSF!$E$55:$O$56,2,FALSE)=\"Individual (Couple)\",SMSF!I$56=\"Individual (Couple)\"),$A6)","v":false},{"$f":"IF(AND(E$1<>$A6,HLOOKUP($A6,SMSF!$E$55:$O$56,2,FALSE)=\"Individual (Couple)\",SMSF!K$56=\"Individual (Couple)\"),$A6)","v":false},{"$f":"IF(AND(F$1<>$A6,HLOOKUP($A6,SMSF!$E$55:$O$56,2,FALSE)=\"Individual (Couple)\",SMSF!M$56=\"Individual (Couple)\"),$A6)","v":false},{"$f":"IF(AND(G$1<>$A6,HLOOKUP($A6,SMSF!$E$55:$O$56,2,FALSE)=\"Individual (Couple)\",SMSF!O$56=\"Individual (Couple)\"),$A6)","v":false},null,null,null,null,null,{"$f":"SMSF!E25","v":""},{"$f":"IF(M6=\"\",\"Valid\",\"Invalid\")","v":"Valid"}]
["Member 6",{"$f":"IF(AND(B$1<>$A7,HLOOKUP($A7,SMSF!$E$55:$O$56,2,FALSE)=\"Individual (Couple)\",SMSF!E$56=\"Individual (Couple)\"),$A7)","v":false},{"$f":"IF(AND(C$1<>$A7,HLOOKUP($A7,SMSF!$E$55:$O$56,2,FALSE)=\"Individual (Couple)\",SMSF!G$56=\"Individual (Couple)\"),$A7)","v":false},{"$f":"IF(AND(D$1<>$A7,HLOOKUP($A7,SMSF!$E$55:$O$56,2,FALSE)=\"Individual (Couple)\",SMSF!I$56=\"Individual (Couple)\"),$A7)","v":false},{"$f":"IF(AND(E$1<>$A7,HLOOKUP($A7,SMSF!$E$55:$O$56,2,FALSE)=\"Individual (Couple)\",SMSF!K$56=\"Individual (Couple)\"),$A7)","v":false},{"$f":"IF(AND(F$1<>$A7,HLOOKUP($A7,SMSF!$E$55:$O$56,2,FALSE)=\"Individual (Couple)\",SMSF!M$56=\"Individual (Couple)\"),$A7)","v":false},{"$f":"IF(AND(G$1<>$A7,HLOOKUP($A7,SMSF!$E$55:$O$56,2,FALSE)=\"Individual (Couple)\",SMSF!O$56=\"Individual (Couple)\"),$A7)","v":false},null,null,"Valid Status 1"]
[null,null,null,null,null,null,null,null,null,"Individual (Single)"]
[null,{"$f":"IF(MID(SMSF!E56,13,6)<>\"Couple\",\"\",\"N/A\")","v":""},{"$f":"IF(MID(SMSF!G56,13,6)<>\"Couple\",\"\",\"N/A\")","v":""},{"$f":"IF(MID(SMSF!I56,13,6)<>\"Couple\",\"\",\"N/A\")","v":""},{"$f":"IF(MID(SMSF!K56,13,6)<>\"Couple\",\"\",\"N/A\")","v":""},{"$f":"IF(MID(SMSF!M56,13,6)<>\"Couple\",\"\",\"N/A\")","v":""},{"$f":"IF(MID(SMSF!O56,13,6)<>\"Couple\",\"\",\"N/A\")","v":""},null,null,"Individual (Couple)"]
[null,{"$f":"IF(MID(SMSF!E56,13,6)<>\"Couple\",\"\",\"Non-loan party\")","v":""},{"$f":"IF(MID(SMSF!G56,13,6)<>\"Couple\",\"\",\"Non-loan party\")","v":""},{"$f":"IF(MID(SMSF!I56,13,6)<>\"Couple\",\"\",\"Non-loan party\")","v":""},{"$f":"IF(MID(SMSF!K56,13,6)<>\"Couple\",\"\",\"Non-loan party\")","v":""},{"$f":"IF(MID(SMSF!M56,13,6)<>\"Couple\",\"\",\"Non-loan party\")","v":""},{"$f":"IF(MID(SMSF!O56,13,6)<>\"Couple\",\"\",\"Non-loan party\")","v":""}]
[null,{"$f":"IFERROR(INDEX(B$2:B$7,SMALL(IF(ISTEXT(B$2:B$7),ROW(B$1:B$6),\"\"), ROW(B2)-1)),\"-\")","v":"-"},{"$f":"IFERROR(INDEX(C$2:C$7,SMALL(IF(ISTEXT(C$2:C$7),ROW(C$1:C$6),\"\"), ROW(C2)-1)),\"-\")","v":"-"},{"$f":"IFERROR(INDEX(D$2:D$7,SMALL(IF(ISTEXT(D$2:D$7),ROW(D$1:D$6),\"\"), ROW(D2)-1)),\"-\")","v":"-"},{"$f":"IFERROR(INDEX(E$2:E$7,SMALL(IF(ISTEXT(E$2:E$7),ROW(E$1:E$6),\"\"), ROW(E2)-1)),\"-\")","v":"-"},{"$f":"IFERROR(INDEX(F$2:F$7,SMALL(IF(ISTEXT(F$2:F$7),ROW(F$1:F$6),\"\"), ROW(F2)-1)),\"-\")","v":"-"},{"$f":"IFERROR(INDEX(G$2:G$7,SMALL(IF(ISTEXT(G$2:G$7),ROW(G$1:G$6),\"\"), ROW(G2)-1)),\"-\")","v":"-"}]
[null,{"$f":"IFERROR(INDEX(B$2:B$7,SMALL(IF(ISTEXT(B$2:B$7),ROW(B$1:B$6),\"\"), ROW(B3)-1)),\"-\")","v":"-"},{"$f":"IFERROR(INDEX(C$2:C$7,SMALL(IF(ISTEXT(C$2:C$7),ROW(C$1:C$6),\"\"), ROW(C3)-1)),\"-\")","v":"-"},{"$f":"IFERROR(INDEX(D$2:D$7,SMALL(IF(ISTEXT(D$2:D$7),ROW(D$1:D$6),\"\"), ROW(D3)-1)),\"-\")","v":"-"},{"$f":"IFERROR(INDEX(E$2:E$7,SMALL(IF(ISTEXT(E$2:E$7),ROW(E$1:E$6),\"\"), ROW(E3)-1)),\"-\")","v":"-"},{"$f":"IFERROR(INDEX(F$2:F$7,SMALL(IF(ISTEXT(F$2:F$7),ROW(F$1:F$6),\"\"), ROW(F3)-1)),\"-\")","v":"-"},{"$f":"IFERROR(INDEX(G$2:G$7,SMALL(IF(ISTEXT(G$2:G$7),ROW(G$1:G$6),\"\"), ROW(G3)-1)),\"-\")","v":"-"},null,null,"Valid Status 2"]
[null,{"$f":"IFERROR(INDEX(B$2:B$7,SMALL(IF(ISTEXT(B$2:B$7),ROW(B$1:B$6),\"\"), ROW(B4)-1)),\"-\")","v":"-"},{"$f":"IFERROR(INDEX(C$2:C$7,SMALL(IF(ISTEXT(C$2:C$7),ROW(C$1:C$6),\"\"), ROW(C4)-1)),\"-\")","v":"-"},{"$f":"IFERROR(INDEX(D$2:D$7,SMALL(IF(ISTEXT(D$2:D$7),ROW(D$1:D$6),\"\"), ROW(D4)-1)),\"-\")","v":"-"},{"$f":"IFERROR(INDEX(E$2:E$7,SMALL(IF(ISTEXT(E$2:E$7),ROW(E$1:E$6),\"\"), ROW(E4)-1)),\"-\")","v":"-"},{"$f":"IFERROR(INDEX(F$2:F$7,SMALL(IF(ISTEXT(F$2:F$7),ROW(F$1:F$6),\"\"), ROW(F4)-1)),\"-\")","v":"-"},{"$f":"IFERROR(INDEX(G$2:G$7,SMALL(IF(ISTEXT(G$2:G$7),ROW(G$1:G$6),\"\"), ROW(G4)-1)),\"-\")","v":"-"},null,null,"Individual (Single)"]
[null,{"$f":"IFERROR(INDEX(B$2:B$7,SMALL(IF(ISTEXT(B$2:B$7),ROW(B$1:B$6),\"\"), ROW(B5)-1)),\"-\")","v":"-"},{"$f":"IFERROR(INDEX(C$2:C$7,SMALL(IF(ISTEXT(C$2:C$7),ROW(C$1:C$6),\"\"), ROW(C5)-1)),\"-\")","v":"-"},{"$f":"IFERROR(INDEX(D$2:D$7,SMALL(IF(ISTEXT(D$2:D$7),ROW(D$1:D$6),\"\"), ROW(D5)-1)),\"-\")","v":"-"},{"$f":"IFERROR(INDEX(E$2:E$7,SMALL(IF(ISTEXT(E$2:E$7),ROW(E$1:E$6),\"\"), ROW(E5)-1)),\"-\")","v":"-"},{"$f":"IFERROR(INDEX(F$2:F$7,SMALL(IF(ISTEXT(F$2:F$7),ROW(F$1:F$6),\"\"), ROW(F5)-1)),\"-\")","v":"-"},{"$f":"IFERROR(INDEX(G$2:G$7,SMALL(IF(ISTEXT(G$2:G$7),ROW(G$1:G$6),\"\"), ROW(G5)-1)),\"-\")","v":"-"},null,null,"Individual (Couple)"]
[null,{"$f":"IFERROR(INDEX(B$2:B$7,SMALL(IF(ISTEXT(B$2:B$7),ROW(B$1:B$6),\"\"), ROW(B6)-1)),\"-\")","v":"-"},{"$f":"IFERROR(INDEX(C$2:C$7,SMALL(IF(ISTEXT(C$2:C$7),ROW(C$1:C$6),\"\"), ROW(C6)-1)),\"-\")","v":"-"},{"$f":"IFERROR(INDEX(D$2:D$7,SMALL(IF(ISTEXT(D$2:D$7),ROW(D$1:D$6),\"\"), ROW(D6)-1)),\"-\")","v":"-"},{"$f":"IFERROR(INDEX(E$2:E$7,SMALL(IF(ISTEXT(E$2:E$7),ROW(E$1:E$6),\"\"), ROW(E6)-1)),\"-\")","v":"-"},{"$f":"IFERROR(INDEX(F$2:F$7,SMALL(IF(ISTEXT(F$2:F$7),ROW(F$1:F$6),\"\"), ROW(F6)-1)),\"-\")","v":"-"},{"$f":"IFERROR(INDEX(G$2:G$7,SMALL(IF(ISTEXT(G$2:G$7),ROW(G$1:G$6),\"\"), ROW(G6)-1)),\"-\")","v":"-"}]
{"$rows_left_out":28}
{"sheet":"Tax Table","index":4,"n_rows":25,"n_cols":9,"rows_kept":25,"cut":false,"hidden":true,"merged":[[3,0,3,2],[8,0,8,2],[3,4,3,5],[17,0,17,2]]}
[]
[null,null,null,null,null,null,null,null,"This is the Tax Offset for Low income earners"]
[null,null,null,null,null,null,null,null,"https://www.ato.gov.au/individuals/income-and-deductions/offsets-and-rebates/low-income-earners/"]
["Medicare Levy 2017 - 2018",null,null,1,"Tax offset for Low income earners"]
["Threshold","Value","Rate",null,"Thresholds","Max Tax Offset"]
["Minimum for partial levy",21980,0.1,null,37500,700]
["Minimum for full levy",27475,0.02]
[]
["Tax 2018-2019"]
["Tax Bracket Min","Tax For Bracket","Tax Rate",null,"Reduced By over 37000K",1.4999999999999999E-2]
[0,0,0]
[18200,0,0.19,2,"Tax offset for Low income earners"]
[37000,{"$f":"(A13-A12)*C12","v":3572},0.32500000000000001,null,"Thresholds","Tax Offset $","Tax Offset%"]
[90000,{"$f":"(A13-A12)*C12+(A14-A13)*C13","v":20797},0.37,null,0,700]
[180000,{"$f":"(A13-A12)*C12+(A14-A13)*C13+(A15-A14)*C14","v":54097},0.45,null,37500,700,-0.05]
{"$rows_left_out":11}
{"sheet":"Inputs","index":5,"n_rows":45,"n_cols":15,"rows_kept":45,"cut":false,"hidden":true,"merged":[[28,9,31,9],[32,9,35,9]]}
["Inputs"]
[null,null,null,null,null,null,null,null,null,null,null,null,null,null,"Note: Please make changes in \"Residential\" Worksheet column K and L"]
["Baseline Assessment Rate",5.5E-2,null,null,null,null,null,"Owner occupied property utilities, rates & costs"]
["Assessment Loading",0.02,null,null,null,null,null,"Rented property costs"]
["Credit Card Commitments",3.8199999999999998E-2,null,null,null,null,null,"Investment property utilities, rates & costs"]
["Workings for Negative Gearing",6.0400000000000002E-2,null,null,null,null,null,"Telephone, Internet, Pay TV & Media Streaming"]
["Other Mortgage Repayment Buffer",1.25,null,null,null,null,null,"Groceries"]
["Rental Income Shading",0.8,null,null,null,null,null,"Recreation & Entertainment"]
[null,null,null,null,null,null,null,"Clothing & Personal Care"]
["Company Tax",0.25,null,null,null,null,null,"Medical & Health"]
[null,null,null,null,null,null,null,"Transport"]
["NumberOfWeeksInAYear",52,null,null,null,null,null,"Education"]
["NumberOfMonthsInAYear",12]
[null,null,null,null,null,null,null,"Childcare"]
["Compulsary Superannuation Percentage",0.11,null,null,null,null,null,"Insurance"]
{"$rows_left_out":31}
{"sheet":"Version Control","index":6,"n_rows":3,"n_cols":6,"rows_kept":3,"cut":false,"hidden":true,"merged":[]}
["Version","Created date","Date Effective","Created By","Approved By","Change"]
[1,"2023-05-29","2023-06-05","Neil Culkin","Neil Culkin","First issuance"]
[2,"2023-09-13","2023-10-16","Neil Culkin\nDevika Dharapalam","Neil Culkin","1. Compulsary Superannuation Percentage updated to 11%\n2. Interest rate buffer reduced from 2.5% to 2%\n3. Minimum DSCR reduced from 1.25% to 1%\n4. Introducing Existing Concessional Contribution income that can be verified through SMSF financials and not requiring Member income & expense section to be completed\n5. Updated row 89 \"Total Commitments (annualised)\" formula to take higher of HEM or DLE, then plus other commitments\n6. Introduction of 5.5% floor rate\n7. Low Income Earner tax offset updated\n8. HEM updated to 2023Q1"]

{"sheet":"Superannuation Assessment notes","index":7,"n_rows":38,"n_cols":10,"rows_kept":38,"cut":false,"hidden":true,"merged":[]}
["UNDERWRITER NOTES- SMSF",null,"INSTRUCTIONS","COMMENTARY"]
["Purpose",null,"If the purpose is for Cash out, Equity Release, Debt consolidation , Property Improvement or the Sole Purpose test is not met the application is to be DECLINED.",null,null,"Purchase O/O (Commercial Only)","Prime FD 50% $3.0M","Yes ","Retail","CAT 1 "]
["Product",null,"Product and LVR Bands",null,null,"Purchase Investment - Commercial","Prime FD >50-65% $3.00M","No ","Office","CAT 2"]
["Loan Amount",null,"Loan Amount",null,null,"Refinance O/O ( Commercial Only)","Prime FD >65-70% $3.00M",null,"Industrial","CAT 3 (Max 60% LVR of $750K). Refer Instructions for CAT 3"]
["Global Exposure",null,"Total Loan Amount of all Pepper exposure held. If this is the only loan state \"No other exposure held\". Max aggregate exp $7.0M",null,null,"Refinance Investment- Commercial","Prime FD >70-75% $ 2.50M",null,"Boarding House"]
["Funds to complete ( Purchase): Are FTC evidenced from SMSF transactional account.",null,"Funds to complete must be evidenced as being available in the members SMSF bank account. This to be evident prior to settlement. If not evident loan cannot proceed.",null,null,"Purchase Investment- Residential","Prime FD >75-80% (Resi Only) $2.0M",null,"Rooming House"]
["Loan term. Interest Only Term",null,"Loan structure . Ie Total loan term and term of interest only",null,null,"Refinance Investment - Residential","Near Prime FD 50% $3.0M",null,"Residential"]
["Is the SMSF a Complying Superannuation Fund.(Search the SMSF ABN)",null,"If answered NO application to be declined. Refer Super Fund ABN Look Up. https://superfundlookup.gov.au/ABN/View?id=65714394898. Reference Tax return or Trust deed dates and addresses.",null,null,null,"Near Prime FD >50-65% $3.00M"]
["Are Members related ?",null,"A member cannot be an employee of another member unless related.",null,null,null,"Near Prime FD >65-70% $3.00M"]
["Asset Class",null,"Description of asset class of security. Any other asset class not located in selection is unacceptable.",null,null,null,"Near Prime FD >70-75% $ 2.50M"]
["Has NG Security Tab been updated",null,"Update NG Security ",null,null,null,"Near Prime FD >75-80% (Resi Only) $1.50M"]
["Is security a single acquirable asset",null,"If the asset asset is not a single acquirable asset the transaction is to be declined."]
["Address",null,"Address of property being offered as security",null,null,null,"Residential",null,"Prime Lender- 6 months BBS"]
["Security Estimate:",null,"Security value amount used for LVR calculation. ",null,null,null,"Commercial - ",null,"Non Prime Lender - 12 mmonths BBS"]
["Location- CAT 1 2, or 3",null,"What is the security Property location category? If CAT 3 maximum LVR is 60% or $750K ( NSW, VIC, QLD, TAS/ACT) whichever is the lower.",null,null,null,null,null,"N/A - For purchase"]
{"$rows_left_out":24}
{"sheet":"Loan Summary","index":8,"n_rows":3,"n_cols":1,"rows_kept":3,"cut":false,"hidden":true,"merged":[]}
["Purpose"]
[]
["Income Summary"]

{"sheet":"Conditions","index":9,"n_rows":0,"n_cols":0,"rows_kept":0,"cut":false,"hidden":true,"merged":[]}

{"sheet":"Workings","index":10,"n_rows":9,"n_cols":1,"rows_kept":9,"cut":false,"hidden":true,"merged":[]}
["Funds To Complete"]
[]
["Purchase"]
["GST ( If applicable)"]
["Stamp Duty"]
["Fees"]
["Total"]
["Less Deposit"]
["Loan Required"]